RDF description of c2_2690
primary topic: metal

metal
type: Concept
has status: Published
modified: 2020-07-01T14:21:38.210+02:00
alternative label: métaux @fr
alternative label: metals
broader: c2 3022
definition: An opaque crystalline material usually of high strength with good electrical and thermal conductivities, ductility and reflectivity.
definition: i def c2 2690
in scheme: anaeeThes
narrower: c_1405698724191
preferred label: métal @fr