RDF description of c2_2691
primary topic: chlorure

chlorure
type: Concept
has status: Published
modified: 2020-09-01T15:21:39.115+02:00
alternative label: CI-
broader: c2 3022
definition: A compound which is derived from hydrochloric acid and contains the chlorine atom in the -1 oxidation state. @en
definition: i def c2 2691
in scheme: anaeeThes
narrower: c 572dfd51
preferred label: chloride @en