RDF description of c2_2694
primary topic: pesticide

pesticide
type: Concept
has status: Published
modified: 2017-03-13T09:44:22Z
broader: c2 3022
definition: i def c2 2694
definition: A general term for chemical agents that are used in order to kill unwanted plants, animals pests or disease-causing fungi, and embracing insecticides, herbicides, fungicides, nematicides, etc. Some pesticides have had widespread disruptive effects among non-target species.
in scheme: anaeeThes