RDF description of c2_2698
primary topic: temperature

temperature
type: Concept
has status: Published
broader: c2 2695
definition: A property that determines the direction of heat flow when an object is brought into thermal contact with other objects: heat flows from regions of higher to those of lower temperatures.
definition: i def c2 2698
in scheme: anaeeThes
narrower: c_1442245624592
preferred label: température @fr