RDF description of c2_2707
primary topic: concentration

concentration
type: Concept
has status: Published
modified: 2017-03-21T13:43:02Z
broader: c2 2695
definition: In solutions, the mass, volume, or number of moles of solute present in proportion to the amount of solvent or total solution.
definition: i def c2 2707
in scheme: anaeeThes