calibration
type: Concept
has status: Published
modified: 2017-03-21T14:18:57Z
broader: c2 168
definition: To mark the scale of a measuring instrument so that readings can be made in appropriate units.
definition: i def c2 2787
in scheme: anaeeThes

RDF description of c2_2787
primary topic: calibration