sampling
type: Concept
has status: Published
modified: 2017-03-21T14:18:49Z
broader: c2 2790
definition: The obtaining of small representative quantities of material for the purpose of analysis.
definition: i def c2 2788
in scheme: anaeeThes
preferred label: échantillonnage @fr

RDF description of c2_2788
primary topic: sampling