RDF description of c2_2790
primary topic: processing

processing
type: Concept
has status: Published
modified: 2017-03-21T14:18:50Z
broader: c2 169
definition: i def c2 2790
definition: The act of converting material from one form into another desired form.
in scheme: anaeeThes
narrower: c2 2788
narrower: c3 2760
narrower: c2 2791
narrower: c3 2763
preferred label: traitement @fr