RDF description of c2_2796
primary topic: chemical treatment

chemical treatment
type: Concept
has status: Published
modified: 2017-03-09T16:37:55Z
broader: c3 2556
definition: i def c2 2796
definition: Processes that alter the chemical structure of the constituents of the waste to produce either an innocuous or a less hazardous material. Chemical processes are attractive because they produce minimal air emissions, they can often be carried out on the site of the waste generator, and some processes can be designed and constructed as mobile units.
in scheme: anaeeThes
narrower: c_1402384751787
narrower: c_1402384713225
narrower: c_1402384733610
narrower: c_1401956020056
narrower: c_1402047106685
narrower: c_1402384598271
narrower: c2 2798
narrower: c_1402386655503
narrower: c2 3019
narrower: c_1402384559550
preferred label: traitement chimique @fr