runoff
type: Concept
has status: Published
modified: 2020-05-25T22:18:17.314+02:00
alternative label: run-off
broader: c3 2545
definition: Rate at which water is removed by flowing over the soil surface. This rate is determined by the texture of the soil, slope, climate, and land use cover (e.g. paved surface, grass, forest, bare soil).
definition: i def c2 2831
in scheme: anaeeThes
narrower: c c55e7c5e
narrower: c 25c37116
preferred label: ruissellement @fr

RDF description of c2_2831
primary topic: runoff