RDF description of c2_2834
primary topic: evapotranspiration

evapotranspiration
type: Concept
has status: Published
modified: 2017-03-21T14:18:29Z
alternative label: actual evapotranspiration
broader: c3 2545
definition: Discharge of water from the earth's surface to the atmosphere by evaporation from lakes, streams and soil surfaces and by transpiration from plants. Also known as fly-off.
definition: i def c2 2834
in scheme: anaeeThes
narrower: c 6deda19a
narrower: c c788e3e8
narrower: c2 2835
narrower: c f1a520af
narrower: c a1c4d361
narrower: c 0d14789b
narrower: c d62f1a05
narrower: c 0cf2821a
narrower: c 53f684aa
narrower: c 2a45ad81
preferred label: évapotranspiration @fr