RDF description of c2_2882
primary topic: groundwater

groundwater
type: Concept
has status: Published
modified: 2020-11-30T20:20:00.346+01:00
alternative label: aquifer
alternative label: aquifère @fr
broader: c2 2599
definition: i def c2 2882
definition: Water that occupies pores and crevices in rock and soil, below the surface and above a layer of impermeable material. It is free to move gravitationally, either downwards towards the impermeable layer or by following a gradient.
in scheme: anaeeThes
narrower: c b3812b24
narrower: c2 2898
narrower: c2 2885
narrower: c2 2884
narrower: c_1405592678936
narrower: c_1437639331995
preferred label: nappe souterraine @fr