spatio-temporal characteristic
type: Concept
has status: Published
modified: 2020-09-10T11:49:35.857+02:00
alternative label: caractéristiques spatio-temporelles @fr
alternative label: spatio-temporal characteristics
definition: Feature having spatial and/or temporal qualities or being related to space-time
definition: xDef 46c0d30d
in scheme: anaeeThes
narrower: c2 117
narrower: c2 123
preferred label: caractéristique spatio-temporelle @fr
top concept of: anaeeThes

RDF description of c2_2934
primary topic: spatio-temporal characteristic