RDF description of c2_2941
primary topic: statistical characteristic

statistical characteristic
type: Concept
has status: Published
modified: 2020-09-10T13:09:24.113+02:00
alternative label: statistical characteristics
alternative label: caractéristiques statistiques @fr
definition: Qualification of the data value(s) such as average, min, max, distribution feature...
definition: xDef 4e129d2c
in scheme: anaeeThes
narrower: c_1405700091939
narrower: c_1402046242224
narrower: c3 3337
narrower: c3 3338
narrower: c_1405703632767
narrower: c3 3334
narrower: c3 3335
narrower: c2 2945
narrower: c2 2944
narrower: c_1405594595387
narrower: c2 2946
narrower: c_1438940171741
narrower: c2 2943
narrower: c2 2942
narrower: c_1405703864081
narrower: c_1405702700373
preferred label: caractéristique statistique @fr
top concept of: anaeeThes