nitrogen fertiliser
type: Concept
has status: Published
modified: 2020-05-11T18:12:18.885+02:00
broader: c2 2756
definition: i def c2 3012
definition: Fertilizer materials, natural or synthesized, containing nitrogen available for fixation by vegetation, such as potassium nitrate or ammonium nitrate.
in scheme: anaeeThes
narrower: c2 2811
narrower: c2 3014
narrower: c2 3013
narrower: c a98b2f08
preferred label: engrais azoté @fr

RDF description of c2_3012
primary topic: nitrogen fertiliser