insecticide
type: Concept
has status: Published
modified: 2020-06-17T12:43:11.336+02:00
alternative label: insectide
broader: c2 2798
definition: Any chemical agent used to destroy invertebrate pests.
definition: i def c2 3015
in scheme: anaeeThes

RDF description of c2_3015
primary topic: insecticide