fungicide
type: Concept
has status: Published
modified: 2020-05-06T09:59:52.778+02:00
broader: c2 2798
definition: Chemicals used to kill or halt the development of fungi that cause plant disease, such as: storage rot; seedling diseases; root rots; vascular wilts; leaf blights, rusts, smuts and mildews, and viral diseases. These can be controlled by the early and continued application of selected fungicides that either kill the pathogens or restrict their development.
definition: i def c2 3017
in scheme: anaeeThes
preferred label: fongicide @fr

RDF description of c2_3017
primary topic: fungicide