chemical compound
type: Concept
has status: Published
modified: 2017-01-30T10:14:05Z
alternative label: composés chimiques @fr
alternative label: chemical compounds
alternative label: chemical component
definition: Any substance used in or resulting from a reaction involving changes to atoms or molecules. (Source: CED)
in scheme: anaeeThes
narrower: c_1403017350586
narrower: c3 343
narrower: c 1899c4e5
narrower: c 4fdccc9b
narrower: c 2562ef0a
narrower: c2 2308
narrower: c c149bae1
narrower: c2 2657
narrower: c 99530b8c
narrower: c2 2667
narrower: c2 2665
narrower: c2 2674
narrower: c fa26fe31
narrower: c2 2685
narrower: c_1405699933094
narrower: c2 2694
narrower: c2 2693
narrower: c2 2660
narrower: c2 2682
narrower: c2 2692
narrower: c2 2691
narrower: c2 2690
preferred label: composé chimique @fr
top concept of: anaeeThes

RDF description of c2_3022
primary topic: chemical compound