plant physiology
type: Concept
has status: Published
modified: 2017-03-21T14:18:22Z
broader: c3 2369
definition: The study of the function and chemical reactions within the various organs of plants.
definition: i def c2 3023
in scheme: anaeeThes
narrower: c3 2318
narrower: c3 2319
narrower: c fd0178ed
narrower: c 320c26e6
narrower: c3 2543
preferred label: physiologie de la plante @fr

RDF description of c2_3023
primary topic: plant physiology