RDF description of c2_455
primary topic: season

season
type: Concept
has status: Published
modified: 2020-05-28T11:18:36.128+02:00
broader: c2 2959
definition: i def c2 455
definition: One of the four equal periods into which the year is divided by the equinoxes and solstices, resulting from the apparent movement of the sun north and south of the equator during the course of the earth's orbit around it. These periods (spring, summer, autumn and winter) have their characteristic weather conditions in different regions, and occur at opposite times of the year in the N and S hemispheres.
in scheme: anaeeThes
preferred label: saison @fr