leaf temperature
type: Concept
has status: Published
modified: 2014-07-18T15:13:00Z
broader: c2 3023
definition: c1 def en e336cb1e
definition: Temperature of the leaves calculated by the double source energy balance method
definition: c1 def fr fec7dd70
definition: Température de feuille ou de culture calculée par le bilan d'énergie avec double source @fr
in scheme: anaeeThes
preferred label: température des feuilles @fr

RDF description of c3_2318
primary topic: leaf temperature