potentiel hydrique foliaire
type: Concept
has status: Published
modified: 2020-04-27T18:06:40.787+02:00
alternative label: potentiel foliaire
broader: c2 3023
definition: c1 def fr 44b18f87
definition: Potentiel foliaire de l'eau calculé par un module de prélèvement d'eau
definition: Leaf water potential calculated by a water uptake method @en
definition: c1 def en da20fba1
in scheme: anaeeThes
narrower: c3 3229
preferred label: leaf water potential @en

RDF description of c3_2319
primary topic: potentiel hydrique foliaire