RDF description of c3_2333
primary topic: genetics

genetics
type: Concept
has status: Published
modified: 2015-07-16T09:28:06Z
broader: c_1401958625930
definition: The branch of science concerned with the means and consequences of transmission and generation of the components of biological inheritance. (Stedman, 26th ed)
definition: i def c3 2333
definition: The science that is concerned with the study of biological inheritance.
in scheme: anaeeThes
narrower: c2 141
narrower: c3 371
narrower: c3 2342
narrower: c 43b51f75
narrower: c2 145
preferred label: génétique @fr