régime de reproduction
type: Concept
has status: Published
modified: 2020-07-03T17:35:59.388+02:00
alternative label: système de reproduction
broader: c 43b51f75
definition: Mating model (panmixia, selfing, mixed mating...) @en
definition: c1 def en 4727a4c3
in scheme: anaeeThes
preferred label: mating system @en

RDF description of c3_2348
primary topic: régime de reproduction