RDF description of c3_2355
primary topic: pest

pest
type: Concept
has status: Published
modified: 2020-05-05T11:56:38.621+02:00
broader: c3 2520
definition: Any organism that damages crops, injures or irritates livestock or man, or reduces the fertility of land.
definition: i def c3 2355
in scheme: anaeeThes
narrower: c4 7112
narrower: c3 2362
narrower: c3 2356
preferred label: ravageur @fr