RDF description of c3_2377
primary topic: stand dominant height

stand dominant height
type: Concept
has status: Published
modified: 2014-07-18T10:12:08Z
broader: c2 151
definition: c1 def en 971288d2
definition: Dominant height at a reference age according to site conditions
in scheme: anaeeThes
preferred label: hauteur dominante @fr