RDF description of c3_2386
primary topic: pollen production

pollen production
type: Concept
has status: Published
broader: c2 134
definition: Pollen production process as a function of tree size
definition: c1 def en 61a89ece
in scheme: anaeeThes
preferred label: production de pollen @fr