carbon cycle
type: Concept
has status: Published
broader: c3 2433
definition: i def c3 2434
definition: The cycle of carbon in the biosphere, in which plants convert carbon dioxide to organic compounds that are consumed by plants and animals, and the carbon is returned to the biosphere in inorganic form by processes of respiration and decay.
in scheme: anaeeThes
narrower: c f15802c1
narrower: c 5c8d8ebf
narrower: c d63cc23c
narrower: c 2ceaf8f9
narrower: c_1437640473665
narrower: c 87a9ffb9
narrower: c 90f8da14
narrower: c_1437640418802
narrower: c4 2690
narrower: c e39c101c
narrower: c3 3370
narrower: c2 2749
narrower: c3 36
narrower: c 182ab6bf
narrower: c_1438244096461
narrower: c c0224e58
narrower: c_1405701197625
narrower: c3 2461
narrower: c_1438932499377
narrower: c3 2594
narrower: c2 2750
narrower: c 3d90bf5c
preferred label: cycle du carbone @fr

RDF description of c3_2434
primary topic: carbon cycle