RDF description of c3_2441
primary topic: deshydrogenase

deshydrogenase
type: Concept
has status: Published
modified: 2020-09-02T10:00:39.934+02:00
alternative label: DES
alternative label: LDH @fr
alternative label: DHase
alternative label: DH
broader: c3 344
broader: c3 2440
definition: c1 def en dfcad570
definition: aquaportail: Deshydrogénase is an oxydoreductase which catalyse hydrogen transfert on an acceptor different from oxygene.
definition: c1 def fr 8169efd8
definition: aquaportail: La déshydrogénase désigne une enzyme de la classe des oxydoréductases qui catalyse la perte d'un Hydrogène ou déshydrogénation par transfert de l'hydrogène sur un accepteur autre que l'oxygène. @fr
in scheme: anaeeThes
preferred label: déshydrogénase @fr