RDF description of c3_2445
primary topic: arylamidase

arylamidase
type: Concept
has status: Published
modified: 2020-09-02T11:27:58.483+02:00
alternative label: AryN
alternative label: EC 3.4.11.2 @en
broader: c3 344
definition: c1 def en 18ea3390
definition: Arylamidase (EC 3.4.11.2) is an amidohydrolase which catalyzes the release of an N-terminal amino acid from peptides, amides, or arylamides (V. Acosta-Martı´nez and M. A. Tabatabai -2000) @en
definition: Arylamidase (EC 3.4.11.2)est une amidohydrolase qui catalyse la libération des acides aminés N-terminaux des peptides, amides, ou arylamides (V. Acosta-Martı´nez and M. A. Tabatabai -2000)
definition: c1 def fr 7435846b
in scheme: anaeeThes