RDF description of c3_2455
primary topic: phosphatase

phosphatase
type: Concept
has status: Published
modified: 2014-07-18T14:43:52Z
alternative label: PHOS
broader: c3 344
broader: c3 2453
definition: c1 def en f85ac093
definition: Wikipedia: la phosphatase (EC 3.1.3) est une enzyme qui hydrolyse lun groupement phosphate d'une molécule simple ou d'une macromolécule biologique (Elsgaard and Vinther 2004)
definition: c1 def fr 43e96990
definition: Wikipedia: phosphatase (EC 3.1.3) is an enzyme that removes a phosphate group from its substrate by hydrolysing phosphoric acid monoesters into a phosphate ion and a molecule with a free hydroxyl group @en
in scheme: anaeeThes