water cycle
type: Concept
has status: Published
modified: 2017-03-13T08:14:21Z
broader: c2 113
definition: The movement of water between the oceans, ground surface and atmosphere by evaporation, precipitation and the activity of living organisms, as one of the mayor biogeochemical cycles. Each day water evaporates from the oceans and is carried in the air from the sea over the land, which receives it as precipitation, and finally returns from the land to the sea through rivers, thus completing the cycle.
definition: i def c3 2545
in scheme: anaeeThes
narrower: c 754714f8
narrower: c 4b905d68
narrower: c 47841c31
narrower: c_1438244392955
narrower: c 6832274a
narrower: c_1426245722784
narrower: c2 2829
narrower: c2 2827
narrower: c 741afd63
narrower: c_1438873300632
narrower: c_1437739604761
narrower: c2 2834
narrower: c2 2867
narrower: c_1442246297018
narrower: c 31ef3695
narrower: c_1438873084896
narrower: c3 2516
narrower: c2 2833
narrower: c2 2841
narrower: c2 2831
narrower: c2 2752
narrower: c2 2871
narrower: c_1437641133824
narrower: c d3836ed0
preferred label: cycle hydrique @fr

RDF description of c3_2545
primary topic: water cycle