RDF description of c3_2556
primary topic: gestion des écosystèmes

gestion des écosystèmes
type: Concept
has status: Published
modified: 2018-06-14T18:04:22Z
alternative label: technique de gestion
broader: c2 113
definition: $$01 Management process ? À changer et mettre "management practices"
in scheme: anaeeThes
narrower: c df93dae1
narrower: c dac557a4
narrower: c c37fe816
narrower: c2 166
narrower: c3 2579
narrower: c3 2699
narrower: c_1403017042069
narrower: c3 2636
narrower: c3 2757
narrower: c 9cf5ca0c
narrower: c3 2582
narrower: c 3ae3d229
narrower: c2 2796
narrower: c_1438850358339
narrower: c3 2573
narrower: c3 2561
narrower: c d75e88c0
narrower: c_1437640810278
preferred label: ecosystem management @en