RDF description of c3_2573
primary topic: irrigation

irrigation
type: Concept
has status: Published
modified: 2017-03-13T08:13:51Z
broader: c3 2556
definition: i def c3 2573
definition: 1) To supply land with water so that crops and plants will grow or grow stronger.
in scheme: anaeeThes
narrower: c f9c78dbc
narrower: c2 3001
narrower: c_1438933474724
narrower: c 0a30d2a4
narrower: c2 3003
narrower: c2 3002
narrower: c f58dadf8
narrower: c_09064495
narrower: c2 2860
narrower: c3 2574
narrower: c_73124522