protéine
type: Concept
has status: Published
modified: 2020-06-02T11:57:36.854+02:00
alternative label: PROT
alternative label: proteins @en
alternative label: protéines
broader: c2 126
definition: c1 def fr 5655cbe0
definition: c1 def en c0987b92
definition: wikipedia: Proteins are large biological molecules, or macromolecules, consisting of one or more chains of amino acid residues. Proteins perform a vast array of functions within living organisms. @en
definition: i def c3 2589
definition: wikipedia: Une protéine est une macromolécule biologique composée d’une ou plusieurs chaînes d'acides aminés liés entre eux par des liaisons peptidiques (chaine polypeptidique). l'immense majorité des fonctions cellulaires est assurée par des protéines.
definition: Any of a class of high-molecular weight polymer compounds composed of a variety of alfa-amino acids joined by peptide linkages. @en
in scheme: anaeeThes
preferred label: protein @en

RDF description of c3_2589
primary topic: protéine