RDF description of c3_2595
primary topic: soil heat flux

soil heat flux
type: Concept
has status: Published
modified: 2018-08-17T16:11:46Z
broader: c3 2592
definition: amount of enery used to store the heat in the soil
definition: c1 def fr 8754d531
definition: c1 def en 1ec3b481
definition: quantité d'énergie utilisée pour la conduction de la chaleur dans le sol @fr
in scheme: anaeeThes
narrower: c c9789f95
narrower: c ec85a2aa
narrower: c c075904f
preferred label: flux de chaleur dans le sol @fr