RDF description of c3_2628
primary topic: lake

lake
type: Concept
has status: Published
broader: c 43043f32
definition: An enclosed body of water, usually but not necessarily fresh water, from which the sea is excluded.
definition: i def c3 2628
in scheme: anaeeThes
narrower: c_1437656784138
narrower: c_1437656427418
preferred label: lac @fr