RDF description of c3_2630
primary topic: pond

pond
type: Concept
has status: Published
modified: 2017-03-13T08:53:44Z
broader: c 43043f32
definition: i def c3 2630
definition: A natural body of standing fresh water occupying a small surface depression, usually smaller than a lake and larger than a pool.
in scheme: anaeeThes
preferred label: étang @fr