breeding
type: Concept
has status: Published
modified: 2020-09-01T11:38:00.501+02:00
broader: c3 2556
definition: The application of genetic principles to the improvement of farm animals and cultivated plants.
definition: i def c3 2636
in scheme: anaeeThes
narrower: c3 2658
narrower: c3 2657
narrower: c3 2717
narrower: c_1402045283316
narrower: c_1402045772859
narrower: c_1403182430031
narrower: c_1402043357416
narrower: c3 2730
narrower: c3 2731
preferred label: élevage @fr

RDF description of c3_2636
primary topic: breeding