RDF description of c3_2717
primary topic: grazing

grazing
type: Concept
has status: Published
modified: 2017-03-09T09:10:26Z
broader: c3 2636
definition: The vegetation on pastures that is available for livestock to feed upon.
definition: i def c3 2717
in scheme: anaeeThes
narrower: c_1402042659128
narrower: c_1402045196649
preferred label: pâturage @fr