RDF description of c3_2750
primary topic: opérateur

opérateur
type: Concept
has status: Published
modified: 2020-09-01T11:03:20.629+02:00
broader: c2 169
definition: c1 def fr 4fcb96a4
definition: personne qui intervient (nettoyage, relevé, etc…)
in scheme: anaeeThes
preferred label: operator @en