volume
type: Concept
has status: Published
modified: 2016-01-27T08:38:51Z
broader: c2 2695
definition: c1 def fr 287671fe
definition: mesure de l'espace contenu dans un objet défini en trois dimension.
in scheme: anaeeThes

RDF description of c3_2765
primary topic: volume