sonde CTD009
type: Concept
has status: Published
modified: 2014-12-08T10:37:09Z
broader: c3 2818
definition: c1 def fr a7259582
definition: sonde multiparamètres SSDA : Standard Data Acquisition
in scheme: anaeeThes
preferred label: CTD009 probe @en

RDF description of c3_2790
primary topic: sonde CTD009