RDF description of c3_2791
primary topic: sonde CTM 214

sonde CTM 214
type: Concept
has status: Published
modified: 2014-12-08T10:37:40Z
broader: c3 2818
definition: c1 def fr aa6a3d51
definition: sonde multiparamètres SSDA : Standard Data Acquisition à mémorisation
in scheme: anaeeThes
preferred label: CTM 214 probe @en