sonde multiparamètres ME Meerestechnik Electronics
type: Concept
has status: Published
modified: 2020-09-02T15:00:11.425+02:00
alternative label: sonde me
broader: c3 2818
definition: sonde multiparamètres ME Meerestechnik Elektronik
definition: c1 def fr aa87bbe0
in scheme: anaeeThes
preferred label: multiparameter probe ME Meerestechnik Elektronik @en

RDF description of c3_2793
primary topic: sonde multiparamètres ME Meerestechnik Electronics