SHL 395
type: Concept
has status: Published
modified: 2014-12-08T10:37:33Z
broader: c3 2825
definition: Modèle 395 étalonnée INRA Avignon. Utilisée sur la jetée du 18.07.1989 au 09.06.1991
definition: c1 def fr 847a662a
in scheme: anaeeThes

RDF description of c3_2827
primary topic: SHL 395