station rives
type: Concept
has status: Published
modified: 2014-12-08T11:22:17Z
broader: c3 2825
definition: c1 def fr f6161bbc
definition: Station météo fournie et étalonnée par l'INRA d'Avignon. Utilisée à Rives
in scheme: anaeeThes
preferred label: rives station @en

RDF description of c3_2829
primary topic: station rives