RDF description of c3_3335
primary topic: donnée qualitative

donnée qualitative
type: Concept
has status: Published
modified: 2017-03-09T17:27:03Z
broader: c2 2941
definition: c1 def fr 7aa58cfb
definition: indicateur si la donnée est qualitative (oui/non)
in scheme: anaeeThes
preferred label: qualitative data @en