RDF description of c3_3369
primary topic: aquatic ecosystem

aquatic ecosystem
type: Concept
has status: Published
modified: 2017-03-21T14:18:32Z
broader: c2 114
definition: i def c3 3369
definition: Any watery environment, from small to large, from pond to ocean, in which plants and animals interact with the chemical and physical features of the environment.
in scheme: anaeeThes
narrower: c cce89a27
narrower: c 43043f32
preferred label: écosystème aquatique @fr