animal characteristic
type: Concept
has status: Published
modified: 2020-09-10T13:10:25.138+02:00
alternative label: animal characteristics
broader: c2 112
definition: Any traits of one animal or of a population: anatomy, biology, behaviour...
in scheme: anaeeThes
narrower: c_1402037804013
narrower: c3 361
preferred label: caractéristique animale @fr

RDF description of c3_3380
primary topic: animal characteristic